{"text_format":"1","workbook":"xlsx","n_sheets":3,"sheets":["Analyse","data","Sheet5"],"not_rendered":{"charts":0,"images":0,"macros":1,"external_links":0,"defined_names":2,"comments":0,"pivot_tables":0},"unopened":[],"bounds":{"document_bytes":16777216,"sheet_cells":100000,"rows_first":2000,"rows_last":500,"rows_between":2000,"halvings":0,"cell_chars":16384,"cell_head_chars":4096},"cells_cut":0,"cells_raw":0,"read":"whole","date_system":"1900"}

{"sheet":"Analyse","index":0,"n_rows":100,"n_cols":7,"rows_kept":100,"cut":false,"hidden":false,"merged":[[6,2,6,6],[34,1,34,6]]}
[]
[]
[]
[null,"Tablet Vergelijker"]
[null,"Tip:klik hier voor de beste tablet deals (voordelig en betrouwbaar)"]
[]
[null,"www.firmfocus.biz","SELECTEER PRODUCTEN ONDER  =>"]
[null,"Kies rechts de tablet en zie specificaties ->","Apple iPad 4 16GB 4G","Apple iPad 2 3G 16GB","Samsung GALAXY NOTE 10 16GB 3G","Apple iPad 3 16GB 4G wit","Empire Electronix M712 4GB WiFi"]
[null,"Prijsinformatie",{"$f":"HLOOKUP($B9,data!$A$1:$AC$58,Analyse!C$33,FALSE)","v":"EUR 604 en EUR 764"},{"$f":"HLOOKUP($B9,data!$A$1:$AC$58,Analyse!D$33,FALSE)","v":"EUR 469 en EUR 631"},{"$f":"HLOOKUP($B9,data!$A$1:$AC$58,Analyse!E$33,FALSE)","v":"EUR 459 en EUR 619"},{"$f":"HLOOKUP($B9,data!$A$1:$AC$58,Analyse!F$33,FALSE)","v":"EUR 519 en EUR 629"},{"$f":"HLOOKUP($B9,data!$A$1:$AC$58,Analyse!G$33,FALSE)","v":"EUR 89 en EUR 102"}]
[null,"Partnumber",{"$f":"HLOOKUP($B10,data!$A$1:$AC$58,Analyse!C$33,FALSE)","v":"MD522NF/A"},{"$f":"HLOOKUP($B10,data!$A$1:$AC$58,Analyse!D$33,FALSE)","v":"MC982FD/A"},{"$f":"HLOOKUP($B10,data!$A$1:$AC$58,Analyse!E$33,FALSE)","v":"GT-N8000ZWADBT"},{"$f":"HLOOKUP($B10,data!$A$1:$AC$58,Analyse!F$33,FALSE)","v":"MD369NF/A"},{"$f":"HLOOKUP($B10,data!$A$1:$AC$58,Analyse!G$33,FALSE)","v":0}]
[null,"Afmetingen (H x B x D)",{"$f":"HLOOKUP($B11,data!$A$1:$AC$58,Analyse!C$33,FALSE)","v":"24,1 x 18,6 x 0,9 cm"},{"$f":"HLOOKUP($B11,data!$A$1:$AC$58,Analyse!D$33,FALSE)","v":"24,1 x 18,6 x 0,9 cm"},{"$f":"HLOOKUP($B11,data!$A$1:$AC$58,Analyse!E$33,FALSE)","v":"26,2 x 18,0 x 0,9 cm"},{"$f":"HLOOKUP($B11,data!$A$1:$AC$58,Analyse!F$33,FALSE)","v":"24,1 x 18,6 x 0,9 cm"},{"$f":"HLOOKUP($B11,data!$A$1:$AC$58,Analyse!G$33,FALSE)","v":"x x cm"}]
[null,"EAN",{"$f":"HLOOKUP($B12,data!$A$1:$AC$58,Analyse!C$33,FALSE)","v":885909657957},{"$f":"HLOOKUP($B12,data!$A$1:$AC$58,Analyse!D$33,FALSE)","v":8715319818872},{"$f":"HLOOKUP($B12,data!$A$1:$AC$58,Analyse!E$33,FALSE)","v":8806071977157},{"$f":"HLOOKUP($B12,data!$A$1:$AC$58,Analyse!F$33,FALSE)","v":885909571246},{"$f":"HLOOKUP($B12,data!$A$1:$AC$58,Analyse!G$33,FALSE)","v":8718226790071}]
[null,"Kleuren",{"$f":"HLOOKUP($B13,data!$A$1:$AC$58,Analyse!C$33,FALSE)","v":"zwart"},{"$f":"HLOOKUP($B13,data!$A$1:$AC$58,Analyse!D$33,FALSE)","v":"wit"},{"$f":"HLOOKUP($B13,data!$A$1:$AC$58,Analyse!E$33,FALSE)","v":"wit"},{"$f":"HLOOKUP($B13,data!$A$1:$AC$58,Analyse!F$33,FALSE)","v":"wit"},{"$f":"HLOOKUP($B13,data!$A$1:$AC$58,Analyse!G$33,FALSE)","v":0}]
[null,"Beeldscherm grootte",{"$f":"HLOOKUP($B14,data!$A$1:$AC$58,Analyse!C$33,FALSE)","v":9.6999999999999993},{"$f":"HLOOKUP($B14,data!$A$1:$AC$58,Analyse!D$33,FALSE)","v":9.6999999999999993},{"$f":"HLOOKUP($B14,data!$A$1:$AC$58,Analyse!E$33,FALSE)","v":10.1},{"$f":"HLOOKUP($B14,data!$A$1:$AC$58,Analyse!F$33,FALSE)","v":9.6999999999999993},{"$f":"HLOOKUP($B14,data!$A$1:$AC$58,Analyse!G$33,FALSE)","v":7}]
[null,"Beeldschermresolutie",{"$f":"HLOOKUP($B15,data!$A$1:$AC$58,Analyse!C$33,FALSE)","v":"2048 bij 1536"},{"$f":"HLOOKUP($B15,data!$A$1:$AC$58,Analyse!D$33,FALSE)","v":"1024 bij 768"},{"$f":"HLOOKUP($B15,data!$A$1:$AC$58,Analyse!E$33,FALSE)","v":"1280 bij 800"},{"$f":"HLOOKUP($B15,data!$A$1:$AC$58,Analyse!F$33,FALSE)","v":"2048 bij 1536"},{"$f":"HLOOKUP($B15,data!$A$1:$AC$58,Analyse!G$33,FALSE)","v":"800 bij 480"}]
[null,"HD",{"$f":"HLOOKUP($B16,data!$A$1:$AC$58,Analyse!C$33,FALSE)","v":"Full HD"},{"$f":"HLOOKUP($B16,data!$A$1:$AC$58,Analyse!D$33,FALSE)","v":"HD ready"},{"$f":"HLOOKUP($B16,data!$A$1:$AC$58,Analyse!E$33,FALSE)","v":0},{"$f":"HLOOKUP($B16,data!$A$1:$AC$58,Analyse!F$33,FALSE)","v":"Full HD"},{"$f":"HLOOKUP($B16,data!$A$1:$AC$58,Analyse!G$33,FALSE)","v":0}]
[null,"Resolutie webcam (Megapixels)",{"$f":"HLOOKUP($B17,data!$A$1:$AC$58,Analyse!C$33,FALSE)","v":"5 Megapixels"},{"$f":"HLOOKUP($B17,data!$A$1:$AC$58,Analyse!D$33,FALSE)","v":0},{"$f":"HLOOKUP($B17,data!$A$1:$AC$58,Analyse!E$33,FALSE)","v":"5,0 Megapixels"},{"$f":"HLOOKUP($B17,data!$A$1:$AC$58,Analyse!F$33,FALSE)","v":"5 Megapixels"},{"$f":"HLOOKUP($B17,data!$A$1:$AC$58,Analyse!G$33,FALSE)","v":0}]
[null,"Aansluitingen",{"$f":"HLOOKUP($B18,data!$A$1:$AC$58,Analyse!C$33,FALSE)","v":"Bluetooth, WiFi (802.11g), WiFi (802.11n)"},{"$f":"HLOOKUP($B18,data!$A$1:$AC$58,Analyse!D$33,FALSE)","v":"Bluetooth, Bluetooth met A2DP, hoofdtelefoon, WiFi (802.11g), WiFi (802.11n)"},{"$f":"HLOOKUP($B18,data!$A$1:$AC$58,Analyse!E$33,FALSE)","v":"Bluetooth, HDMI, hoofdtelefoon, WiFi (802.11g)"},{"$f":"HLOOKUP($B18,data!$A$1:$AC$58,Analyse!F$33,FALSE)","v":"Bluetooth, WiFi (802.11g), WiFi (802.11n)"},{"$f":"HLOOKUP($B18,data!$A$1:$AC$58,Analyse!G$33,FALSE)","v":"HDMI, hoofdtelefoon, USB 2.0, WiFi (802.11g)"}]
[null,"Totale opslagcapaciteit",{"$f":"HLOOKUP($B19,data!$A$1:$AC$58,Analyse!C$33,FALSE)","v":"16 GB"},{"$f":"HLOOKUP($B19,data!$A$1:$AC$58,Analyse!D$33,FALSE)","v":"16 GB"},{"$f":"HLOOKUP($B19,data!$A$1:$AC$58,Analyse!E$33,FALSE)","v":"16 GB"},{"$f":"HLOOKUP($B19,data!$A$1:$AC$58,Analyse!F$33,FALSE)","v":"16 GB"},{"$f":"HLOOKUP($B19,data!$A$1:$AC$58,Analyse!G$33,FALSE)","v":"4 GB"}]
[null,"Type opslag",{"$f":"HLOOKUP($B20,data!$A$1:$AC$58,Analyse!C$33,FALSE)","v":"Flash"},{"$f":"HLOOKUP($B20,data!$A$1:$AC$58,Analyse!D$33,FALSE)","v":"Flash"},{"$f":"HLOOKUP($B20,data!$A$1:$AC$58,Analyse!E$33,FALSE)","v":"Flash"},{"$f":"HLOOKUP($B20,data!$A$1:$AC$58,Analyse!F$33,FALSE)","v":"Flash"},{"$f":"HLOOKUP($B20,data!$A$1:$AC$58,Analyse!G$33,FALSE)","v":"Flash"}]
[null,"Intern geheugen",{"$f":"HLOOKUP($B21,data!$A$1:$AC$58,Analyse!C$33,FALSE)","v":0},{"$f":"HLOOKUP($B21,data!$A$1:$AC$58,Analyse!D$33,FALSE)","v":0},{"$f":"HLOOKUP($B21,data!$A$1:$AC$58,Analyse!E$33,FALSE)","v":0},{"$f":"HLOOKUP($B21,data!$A$1:$AC$58,Analyse!F$33,FALSE)","v":0},{"$f":"HLOOKUP($B21,data!$A$1:$AC$58,Analyse!G$33,FALSE)","v":"0,5 GB"}]
[null,"Geheugenkaarten",{"$f":"HLOOKUP($B22,data!$A$1:$AC$58,Analyse!C$33,FALSE)","v":0},{"$f":"HLOOKUP($B22,data!$A$1:$AC$58,Analyse!D$33,FALSE)","v":0},{"$f":"HLOOKUP($B22,data!$A$1:$AC$58,Analyse!E$33,FALSE)","v":0},{"$f":"HLOOKUP($B22,data!$A$1:$AC$58,Analyse!F$33,FALSE)","v":0},{"$f":"HLOOKUP($B22,data!$A$1:$AC$58,Analyse!G$33,FALSE)","v":"Micro-SD"}]
[null,"Accu",{"$f":"HLOOKUP($B23,data!$A$1:$AC$58,Analyse!C$33,FALSE)","v":"Lithium-Polymeer"},{"$f":"HLOOKUP($B23,data!$A$1:$AC$58,Analyse!D$33,FALSE)","v":"Lithium-Polymeer"},{"$f":"HLOOKUP($B23,data!$A$1:$AC$58,Analyse!E$33,FALSE)","v":0},{"$f":"HLOOKUP($B23,data!$A$1:$AC$58,Analyse!F$33,FALSE)","v":"Lithium-Polymeer"},{"$f":"HLOOKUP($B23,data!$A$1:$AC$58,Analyse!G$33,FALSE)","v":"Lithium-Ion"}]
[null,"Vermogen accu",{"$f":"HLOOKUP($B24,data!$A$1:$AC$58,Analyse!C$33,FALSE)","v":"42,5 Wh"},{"$f":"HLOOKUP($B24,data!$A$1:$AC$58,Analyse!D$33,FALSE)","v":"25 Wh"},{"$f":"HLOOKUP($B24,data!$A$1:$AC$58,Analyse!E$33,FALSE)","v":0},{"$f":"HLOOKUP($B24,data!$A$1:$AC$58,Analyse!F$33,FALSE)","v":"42,5 Wh"},{"$f":"HLOOKUP($B24,data!$A$1:$AC$58,Analyse!G$33,FALSE)","v":0}]
[null,"Capaciteit accu",{"$f":"HLOOKUP($B25,data!$A$1:$AC$58,Analyse!C$33,FALSE)","v":0},{"$f":"HLOOKUP($B25,data!$A$1:$AC$58,Analyse!D$33,FALSE)","v":0},{"$f":"HLOOKUP($B25,data!$A$1:$AC$58,Analyse!E$33,FALSE)","v":"7000 mAh"},{"$f":"HLOOKUP($B25,data!$A$1:$AC$58,Analyse!F$33,FALSE)","v":0},{"$f":"HLOOKUP($B25,data!$A$1:$AC$58,Analyse!G$33,FALSE)","v":"2500 mAh"}]
[null,"Video-afspeeltijd",{"$f":"HLOOKUP($B26,data!$A$1:$AC$58,Analyse!C$33,FALSE)","v":0},{"$f":"HLOOKUP($B26,data!$A$1:$AC$58,Analyse!D$33,FALSE)","v":"10 uur"},{"$f":"HLOOKUP($B26,data!$A$1:$AC$58,Analyse!E$33,FALSE)","v":0},{"$f":"HLOOKUP($B26,data!$A$1:$AC$58,Analyse!F$33,FALSE)","v":0},{"$f":"HLOOKUP($B26,data!$A$1:$AC$58,Analyse!G$33,FALSE)","v":0}]
[null,"Levensduur accu (max.)",{"$f":"HLOOKUP($B27,data!$A$1:$AC$58,Analyse!C$33,FALSE)","v":"10 uur"},{"$f":"HLOOKUP($B27,data!$A$1:$AC$58,Analyse!D$33,FALSE)","v":0},{"$f":"HLOOKUP($B27,data!$A$1:$AC$58,Analyse!E$33,FALSE)","v":"1500,0 uur"},{"$f":"HLOOKUP($B27,data!$A$1:$AC$58,Analyse!F$33,FALSE)","v":"10 uur"},{"$f":"HLOOKUP($B27,data!$A$1:$AC$58,Analyse!G$33,FALSE)","v":0}]
[null,"Besturingssysteem",{"$f":"HLOOKUP($B28,data!$A$1:$AC$58,Analyse!C$33,FALSE)","v":"iOS"},{"$f":"HLOOKUP($B28,data!$A$1:$AC$58,Analyse!D$33,FALSE)","v":"iOS"},{"$f":"HLOOKUP($B28,data!$A$1:$AC$58,Analyse!E$33,FALSE)","v":"Android"},{"$f":"HLOOKUP($B28,data!$A$1:$AC$58,Analyse!F$33,FALSE)","v":"iOS"},{"$f":"HLOOKUP($B28,data!$A$1:$AC$58,Analyse!G$33,FALSE)","v":"Android"}]
[null,"Toevoeging besturingssysteem",{"$f":"HLOOKUP($B29,data!$A$1:$AC$58,Analyse!C$33,FALSE)","v":0},{"$f":"HLOOKUP($B29,data!$A$1:$AC$58,Analyse!D$33,FALSE)","v":"iOS 4.3"},{"$f":"HLOOKUP($B29,data!$A$1:$AC$58,Analyse!E$33,FALSE)","v":"4.0"},{"$f":"HLOOKUP($B29,data!$A$1:$AC$58,Analyse!F$33,FALSE)","v":"5.1"},{"$f":"HLOOKUP($B29,data!$A$1:$AC$58,Analyse!G$33,FALSE)","v":"4.0"}]
[null,"Processor",{"$f":"HLOOKUP($B30,data!$A$1:$AC$58,Analyse!C$33,FALSE)","v":"Dual Core A6X quad-core graphics"},{"$f":"HLOOKUP($B30,data!$A$1:$AC$58,Analyse!D$33,FALSE)","v":"Dual-Core"},{"$f":"HLOOKUP($B30,data!$A$1:$AC$58,Analyse!E$33,FALSE)","v":0},{"$f":"HLOOKUP($B30,data!$A$1:$AC$58,Analyse!F$33,FALSE)","v":"Dual Core A5X"},{"$f":"HLOOKUP($B30,data!$A$1:$AC$58,Analyse!G$33,FALSE)","v":"Cortex A8"}]
{"$rows_left_out":71}
{"sheet":"data","index":1,"n_rows":58,"n_cols":29,"rows_kept":58,"cut":false,"hidden":true,"merged":[]}
["Product","row","Prijsinformatie","Partnumber","Afmetingen (H x B x D)","EAN","Kleuren","Beeldscherm grootte","Beeldschermresolutie","HD","Resolutie webcam (Megapixels)","Resolutie webcam","Mobiel","Simkaart ondersteuning","Aansluitingen","Totale opslagcapaciteit","Type opslag","Intern geheugen","Geheugenkaarten","Accu","Vermogen accu","Capaciteit accu","Video-afspeeltijd","Levensduur accu (max.)","Besturingssysteem","Toevoeging besturingssysteem","Processor","Kloksnelheid","Gewicht"]
["Samsung Galaxy Note 10.1",2,"EUR 444 en EUR 556","GT-N8010EAAPHN","26,2 x 18,0 x 0,9 cm",8806071992846,"grijs",10.1,"1280 bij 800",null,"5,0 Megapixels",null,null,null,"Bluetooth, HDMI, hoofdtelefoon, WiFi (802.11g)","16 GB","Flash","2 GB",1,null,null,null,null,"1500,0 uur",null,null,null,"1,4 GHz","597 gram"]
["Apple iPad 2 16GB zwart",3,"EUR 376 en EUR 456","MC769LL/A","24,1 x 18,6 x 0,9 cm",8715319818803,"zwart",9.6999999999999993,"1024 bij 768","HD ready",null,null,null,null,"Bluetooth, Bluetooth met A2DP, hoofdtelefoon, WiFi (802.11g), WiFi (802.11n)","16 GB","Flash",null,null,"Lithium-Polymeer","25 Wh",null,"10 uur",null,"iOS","iOS 4.3","Dual-Core","1 GHz","601 gram"]
["Apple iPad mini 16GB WiFi zwart",4,"EUR 327 en EUR 402","MD528NF/A","20 x 13,5 x 0,7 cm",885909666898,"zwart",7.9,"1024 bij 768","HD ready","5 Megapixels",null,null,null,"Bluetooth, hoofdtelefoon, WiFi (802.11g), WiFi (802.11n)","16 GB",null,null,null,"Lithium-Polymeer","16,3 Wh",null,null,"10 uur","iOS",null,"Apple A5 Cortex A9 dual-core",null,"308 gram"]
["Apple iPad 3 16GB wit",5,"EUR 444 en EUR 530","MD328NF/A","24,1 x 18,6 x 0,9 cm",885909550319,"wit",9.6999999999999993,"2048 bij 1536","Full HD","5 Megapixels",null,null,null,"Bluetooth, WiFi (802.11g), WiFi (802.11n)","16 GB","Flash",null,null,"Lithium-Polymeer","42,5 Wh",null,null,"10 uur","iOS","5.1","Dual Core A5X",null,"652 gram"]
["Apple iPad 3 32GB zwart",6,"EUR 477 en EUR 589","MC706NF/A","24,1 x 18,6 x 0,9 cm",885909549696,"zwart",9.6999999999999993,"2048 bij 1536","Full HD","5 Megapixels",null,null,null,"Bluetooth, WiFi (802.11g), WiFi (802.11n)","32 GB","Flash",null,null,"Lithium-Polymeer","42,5 Wh",null,null,"10 uur","iOS","5.1","Dual Core A5X",null,"652 gram"]
["Apple iPad 4 16GB WiFi zwart",7,"EUR 478 en EUR 603","MD510NF/A","24,1 x 18,6 x 0,9 cm",885909652266,"zwart",9.6999999999999993,"2048 bij 1536","Full HD","5 Megapixels",null,null,null,"Bluetooth, WiFi (802.11g), WiFi (802.11n)","16 GB","Flash",null,null,"Lithium-Polymeer","42,5 Wh",null,null,"10 uur","iOS",null,"Dual Core A6X quad-core graphics",null,"652 gram"]
["Asus Google Nexus 7 32GB",8,"EUR 244 en EUR 249","90OK0MI1101080U","19,9 x 12 x 1 cm",4716659343271,null,7,"1280 bij 800",null,"1,2 Megapixels",null,null,null,"WiFi (802.11g), WiFi (802.11n)","32 GB","Flash",null,null,null,null,"4325 mAh","9 uur",null,"Android","4.1 JellyBean","Quad-core Tegra 3","1,3 GHz","340 gram"]
["Samsung Galaxy Tab P3110",9,"EUR 209 en EUR 281","GT-P3110TSAPHN","12,1 x 19,4 x 1,1 cm",8806085112216,"zilver, titanium",7,"1024 bij 600",null,"0,3 Megapixels","640 x 480",null,null,"Bluetooth, hoofdtelefoon, USB 2.0, WiFi (802.11g), WiFi (802.11n)","8 GB","Flash","1 GB","Micro-SD",null,null,null,null,null,"Android","4.0",null,"1 GHz"]
["Apple iPad 4 32GB WiFi zwart",10,"EUR 574 en EUR 724","MD511NF/A","24,1 x 18,6 x 0,9 cm",885909652532,"zwart",9.6999999999999993,"2048 bij 1536","Full HD","5 Megapixels",null,null,null,"Bluetooth, WiFi (802.11g), WiFi (802.11n)","32 GB","Flash",null,null,"Lithium-Polymeer","42,5 Wh",null,null,"10 uur","iOS",null,"Dual Core A6X quad-core graphics",null,"652 gram"]
["Asus Transformer Pad TF300T 32GB ex dock",11,"EUR 350 en EUR 462","TF300T-1A124A","26,3 x 18 x 1 cm",4716659194149,"wit",10.1,"1280 bij 800",null,"8 Megapixels",null,null,null,"Bluetooth, HDMI, hoofdtelefoon, WiFi (802.11g), WiFi (802.11n)","32 GB","SSD","1 GB","Micro-SD, Micro-SDHC","Lithium-Polymeer","22 Wh",null,null,"10 uur","Android","4.0","nVidia Tegra 3","1,2 GHz","635 gram"]
["Samsung Galaxy Note 10.1 16GB wiFi",12,"EUR 439 en EUR 499","GT-N8010ZWAPHN","18 x 26,2 x 0,9 cm",8806085260368,"wit",10.1,"1280 bij 800",null,"5 Megapixels",null,null,null,"Bluetooth, USB 2.0, WiFi (802.11g), WiFi (802.11n)","16 GB","SSD",null,null,null,null,null,null,null,"Android","Google Android 4.0",null,null,"600 gram"]
["Samsung Galaxy Tab 2 P5100 16GB",13,"EUR 395 en EUR 521","GT-P5100TSAPHN","17,5 x 25,7 x 1 cm",8806085012097,"zwart",10.1,"1280 bij 800",null,"3 Megapixels",null,"HSDPA (3.5G)",null,"hoofdtelefoon, USB 2.0, WiFi (802.11g), WiFi (802.11n)","16 GB","Flash","1 GB","Micro-SD","Lithium-Ion",null,"7000 mAh",null,null,"Android","4.0",null,"1 GHz","583 gram"]
["Apple iPad 3 32GB wit",14,"EUR 494 en EUR 589","MD329NF/A","24,1 x 18,6 x 0,9 cm",885909550630,"wit",9.6999999999999993,"2048 bij 1536","Full HD","5 Megapixels",null,null,null,"Bluetooth, WiFi (802.11g), WiFi (802.11n)","32 GB","Flash",null,null,"Lithium-Polymeer","42,5 Wh",null,null,"10 uur","iOS","5.1","Dual Core A5X",null,"652 gram"]
["Asus Transformer Pad Infinity 64GB",15,"EUR 664 en EUR 725","TF700T-1B086A","18,1 x 26,3 x 2 cm",4716659195504,"grijs",10.1,"1920 bij 1200",null,"8 Megapixels",null,null,null,"Bluetooth, HDMI, USB 2.0, WiFi (802.11g), WiFi (802.11n)","64 GB",null,"1 GB","Micro-SD, Micro-SDHC",null,"44,5 Wh",null,null,"14 uur","Android","4.0","nVidia Tegra 3","1,6 GHz","1123 gram"]
["Samsung Galaxy Tab 2 P5110 16 GB Wit",16,"EUR 299 en EUR 409","GT-P5110ZWAPHN","17,5 x 25,7 x 1 cm",8806085140073,"wit",10.1,"1280 bij 800",null,"3 Megapixels",null,null,null,"Bluetooth, hoofdtelefoon, USB 2.0, WiFi (802.11g), WiFi (802.11n)","16 GB","Flash","1 GB","Micro-SD","Lithium-Ion",null,"7000 mAh",null,null,"Android","4.0",null,"1 GHz","581 gram"]
["Apple iPad mini 16GB WiFi wit",17,"EUR 327 en EUR 402","MD531NF/A","20 x 13,5 x 0,7 cm",885909667581,"wit, zilver",7.9,"1024 bij 768","HD ready","5 Megapixels",null,null,null,"Bluetooth, hoofdtelefoon, WiFi (802.11g), WiFi (802.11n)","16 GB",null,null,null,"Lithium-Polymeer","16,3 Wh",null,null,"10 uur","iOS",null,"Apple A5 Cortex A9 dual-core",null,"308 gram"]
["Apple iPad 3 16GB zwart",18,"EUR 448 en EUR 546","MC705NF/A","24,1 x 18,6 x 0,9 cm",885909549382,"zwart",9.6999999999999993,"2048 bij 1536","Full HD","5 Megapixels",null,null,null,"Bluetooth, WiFi (802.11g), WiFi (802.11n)","16 GB","Flash",null,null,"Lithium-Polymeer","42,5 Wh",null,null,"10 uur","iOS","5.1","Dual Core A5X",null,"652 gram"]
["Samsung Galaxy Tab 2 10.1 16GB WiFi",19,"EUR 313 en EUR 349","GT-P5110TSA","17,5 x 25,7 x 1,0 cm",8806085009332,"zilver",10.1,"1280 bij 800",null,"3,2 Megapixels","2048 x 1536","UMTS (3G), nee",null,"Bluetooth, hoofdtelefoon, USB 2.0, WiFi (802.11g)","16 GB","Flash",null,"Micro-SD, ja",null,null,"4000 mAh",null,"9,0 uur",null,null,null,"1,0 GHz","583 gram"]
["Asus Transformer Pad TF300T 32GB incl dock",20,"EUR 450 en EUR 509","TF300T-1A125A","26,3 x 18 x 1 cm",4716659194200,"wit",10.1,"1280 bij 800",null,"8 Megapixels",null,null,null,"Bluetooth, HDMI, hoofdtelefoon, USB 2.0, WiFi (802.11g), WiFi (802.11n)","32 GB","SSD","1 GB","Micro-SD, Micro-SDHC, SD","Lithium-Polymeer","22 Wh",null,null,"15 uur","Android","4.0","nVidia Tegra 3","1,2 GHz","1181 gram"]
["Apple iPad 2 16GB wit",21,"EUR 376 en EUR 485","MC979LL/A","24,1 x 18,6 x 0,9 cm",8715319818810,"wit",9.6999999999999993,"1024 bij 768","HD ready",null,null,null,null,"Bluetooth, Bluetooth met A2DP, hoofdtelefoon, WiFi (802.11g), WiFi (802.11n)","16 GB","Flash",null,null,"Lithium-Polymeer","25 Wh",null,"10 uur",null,"iOS","iOS 4.3","Dual-Core","1 GHz","601 gram"]
["Sony Tablet S",22,"EUR 269 en EUR 480","SGPT111NL/S.NL3","17,4 x 24,1 x 1 cm",4905524798364,"zwart",9.4,"1280 bij 800","HD ready",null,"2592 x 1944",null,null,"Bluetooth, hoofdtelefoon, USB 2.0, WiFi (802.11g), WiFi (802.11n)","16 GB","Flash","1 GB","SD","Lithium-Ion",null,null,"8 uur",null,"Android","Honeycomb 3.1",null,"1 GHz","598 gram"]
["Samsung Galaxy Note 10.1 16GB 3G",23,"EUR 542 en EUR 705","GT-N8000EAAPHN","18 x 26,2 x 0,9 cm",8806085006928,"zwart",10.1,"1280 bij 800",null,"5 Megapixels",null,"HSDPA (3.5G)",null,"Bluetooth, USB 2.0, WiFi (802.11g), WiFi (802.11n)","16 GB","SSD",null,null,null,null,null,null,null,"Android","Google Android 4.0",null,null,"600 gram"]
["Archos 70 internet tablet 8GB",24,99,501582,"20,1 x 11,4 x 1 cm",690590515826,"zwart",7,"800 bij 480","HD ready",null,null,null,null,"Bluetooth, HDMI, USB 2.0, WiFi (802.11g), WiFi (802.11n)","8 GB","Flash",null,"Micro-SD, SDHC","Lithium-Polymeer",null,null,"10 uur",null,"Android","2.2 Froyo","ARM Cortex A8 with DSP","1 GHz","300 gram"]
["Apple iPad 4 16GB WiFi wit",25,"EUR 478 en EUR 603","MD513NF/A","24,1 x 18,6 x 0,9 cm",885909653065,"wit",9.6999999999999993,"2048 bij 1536","Full HD","5 Megapixels",null,null,null,"Bluetooth, WiFi (802.11g), WiFi (802.11n)","16 GB","Flash",null,null,"Lithium-Polymeer","42,5 Wh",null,null,"10 uur","iOS",null,"Dual Core A6X quad-core graphics",null,"652 gram"]
["Asus Vivo Tab TF600T 64GB incl dock",26,"EUR 699 en EUR 829","90OK0NB1100700Y","x x 0,9 cm",null,"grijs",11.6,"1366 bij 768",null,"8 Megapixels",null,null,null,null,"64 GB",null,"2 GB",null,null,null,null,null,null,"Windows 8",null,null,null,"675 gram"]
["Apple iPad 4 64GB WiFi",27,"EUR 668 en EUR 845","MD512NF/A","24,1 x 18,6 x 0,9 cm",885909652808,"zwart",9.6999999999999993,"2048 bij 1536","Full HD","5 Megapixels",null,null,null,"Bluetooth, WiFi (802.11g), WiFi (802.11n)","64 GB","Flash",null,null,"Lithium-Polymeer","42,5 Wh",null,null,"10 uur","iOS",null,"Dual Core A6X quad-core graphics",null,"652 gram"]
["Samsung Galaxy Tab 2 P5110 16 GB",28,"EUR 299 en EUR 409","GT-P5110TSAPHN","17,5 x 25,7 x 1 cm",8806085012127,"zwart",10.1,"1280 bij 800",null,"3 Megapixels",null,null,null,"Bluetooth, hoofdtelefoon, USB 2.0, WiFi (802.11g), WiFi (802.11n)","16 GB","Flash","1 GB","Micro-SD, Micro-SDHC, Micro-SDXC","Lithium-Ion",null,"7000 mAh",null,null,"Android","4.0",null,"1 GHz","588 gram"]
["Yarvik TAB464 GoTab Xerios 10 inch",29,"EUR 149 en EUR 182","TAB464","16,4 x 26,3 x 1,4 cm",8717534018013,"zwart",10,"1024 bij 600",null,null,null,null,null,"HDMI, hoofdtelefoon, USB 2.0, WiFi (802.11g)","8 GB","Flash",null,"Micro-SD, ja","Lithium-Polymeer",null,"7000 mAh",null,"8,0 uur","Android",null,"ARM Cortex-A","1,2 GHz","682 gram"]
["Yarvik tab9-200 Xenta 9.7",30,"EUR 232 en EUR 259","TAB9-200","19,1 x 24,4 x 1 cm",8717534018471,"zilver",9.6999999999999993,"1024 bij 768",null,"2 Megapixels",null,null,null,"Bluetooth, HDMI, hoofdtelefoon, WiFi (802.11g)","16 GB","Flash",null,"Micro-SD, ja",null,null,"8000 mAh","6 uur",null,"Android",null,"ARM Cortex-A","1,6 GHz","638 gram"]
{"$rows_left_out":29}
{"sheet":"Sheet5","index":2,"n_rows":487,"n_cols":6,"rows_kept":487,"cut":false,"hidden":true,"merged":[]}
[]
[]
[]
[]
[]
[]
[]
[]
[]
[]
[]
[]
[]
[]
[]
[]
[]
[]
[]
[]
[]
[null,null,null,null,null,"http://www.firmfocus.biz/"]
[null,null,null,null,null,"http://www.firmfocus.biz/loginpages/login.php"]
[null,null,null,null,null,"http://www.firmfocus.biz/loginpages/mijn_gegevens.php"]
[null,null,null,null,null,"http://www.firmfocus.biz/loginpages/Subscriptionsklanten.php"]
[null,null,null,null,null,"http://www.firmfocus.biz/NL/disclaimer%20Firmfocus.php"]
[null,null,null,null,null,"http://www.firmfocus.biz/NL/documenten/belasting/2011%20plan/informatieblad_autobelastingen.pdf"]
[null,null,null,null,null,"http://www.firmfocus.biz/NL/documenten/belasting/2011%20plan/informatieblad_btw_renovatie.pdf"]
[null,null,null,null,null,"http://www.firmfocus.biz/NL/documenten/belasting/2011%20plan/informatieblad_stimulering_woningmarkt.pdf"]
[null,null,null,null,null,"http://www.firmfocus.biz/NL/documenten/intelligence/CBS/CBS_KW3.pdf"]
{"$rows_left_out":457}